========== build_clang - FAILED Documentation/.renames.txt: warning: ignored by one of the .gitignore files Documentation/.renames.txt: warning: ignored by one of the .gitignore files ../net/wireless/nl80211.c:19576:7: error: use of undeclared identifier 'n_dl_tids' 19576 | n += n_dl_tids * (nla_total_size(0) + /* tid nest header */ | ^~~~~~~~~ 1 error generated. make[5]: *** [../scripts/Makefile.build:290: net/wireless/nl80211.o] Error 1 make[4]: *** [../scripts/Makefile.build:551: net/wireless] Error 2 make[3]: *** [../scripts/Makefile.build:551: net] Error 2 make[3]: *** Waiting for unfinished jobs.... make[2]: *** [/srv/nipa-poller-wireless/wireless-next/wt-0/Makefile:2229: .] Error 2 make[1]: *** [/srv/nipa-poller-wireless/wireless-next/wt-0/Makefile:248: __sub-make] Error 2 make: *** [Makefile:248: __sub-make] Error 2 New errors added --- /tmp/tmp.IalKWOcMKm 2026-09-08 15:31:03.658957669 -0400 +++ /tmp/tmp.leeBGAtlcq 2026-09-08 15:31:43.370705360 -0400 @@ -1,0 +2,11 @@ +../net/wireless/nl80211.c:19576:7: error: use of undeclared identifier 'n_dl_tids' + 19576 | n += n_dl_tids * (nla_total_size(0) + /* tid nest header */ + | ^~~~~~~~~ +1 error generated. +make[5]: *** [../scripts/Makefile.build:290: net/wireless/nl80211.o] Error 1 +make[4]: *** [../scripts/Makefile.build:551: net/wireless] Error 2 +make[3]: *** [../scripts/Makefile.build:551: net] Error 2 +make[3]: *** Waiting for unfinished jobs.... +make[2]: *** [/srv/nipa-poller-wireless/wireless-next/wt-0/Makefile:2229: .] Error 2 +make[1]: *** [/srv/nipa-poller-wireless/wireless-next/wt-0/Makefile:248: __sub-make] Error 2 +make: *** [Makefile:248: __sub-make] Error 2 Per-file breakdown --- /tmp/tmp.KBr2a1qGGA 2026-09-08 15:31:43.374705335 -0400 +++ /tmp/tmp.oQOqkUvtkV 2026-09-08 15:31:43.376290561 -0400 @@ -0,0 +1 @@ + 1 ../net/wireless/nl80211.c