========== build_clang - FAILED Documentation/.renames.txt: warning: ignored by one of the .gitignore files Documentation/.renames.txt: warning: ignored by one of the .gitignore files ../net/wireless/nl80211.c:19576:7: error: use of undeclared identifier 'n_dl_tids' 19576 | n += n_dl_tids * (nla_total_size(0) + /* tid nest header */ | ^~~~~~~~~ 1 error generated. make[5]: *** [../scripts/Makefile.build:290: net/wireless/nl80211.o] Error 1 make[4]: *** [../scripts/Makefile.build:551: net/wireless] Error 2 make[3]: *** [../scripts/Makefile.build:551: net] Error 2 make[3]: *** Waiting for unfinished jobs.... make[2]: *** [/srv/nipa-poller-wireless/wireless-next/wt-0/Makefile:2229: .] Error 2 make[1]: *** [/srv/nipa-poller-wireless/wireless-next/wt-0/Makefile:248: __sub-make] Error 2 make: *** [Makefile:248: __sub-make] Error 2 New errors added --- /tmp/tmp.B6XWbPNWYi 2026-09-07 19:31:58.358575106 -0400 +++ /tmp/tmp.9BZ9N0b1vq 2026-09-07 19:32:40.392346774 -0400 @@ -1,0 +2,11 @@ +../net/wireless/nl80211.c:19576:7: error: use of undeclared identifier 'n_dl_tids' + 19576 | n += n_dl_tids * (nla_total_size(0) + /* tid nest header */ + | ^~~~~~~~~ +1 error generated. +make[5]: *** [../scripts/Makefile.build:290: net/wireless/nl80211.o] Error 1 +make[4]: *** [../scripts/Makefile.build:551: net/wireless] Error 2 +make[3]: *** [../scripts/Makefile.build:551: net] Error 2 +make[3]: *** Waiting for unfinished jobs.... +make[2]: *** [/srv/nipa-poller-wireless/wireless-next/wt-0/Makefile:2229: .] Error 2 +make[1]: *** [/srv/nipa-poller-wireless/wireless-next/wt-0/Makefile:248: __sub-make] Error 2 +make: *** [Makefile:248: __sub-make] Error 2 Per-file breakdown --- /tmp/tmp.YUycIgsjsg 2026-09-07 19:32:40.395346758 -0400 +++ /tmp/tmp.TVYaYwK2pu 2026-09-07 19:32:40.397346747 -0400 @@ -0,0 +1 @@ + 1 ../net/wireless/nl80211.c